BDBM50522387 CHEMBL4538569
SMILES C[C@]1(OC[C@@H](COc2ccc(cc2)N2CCN(CC2)c2ccc(NC(=O)Oc3ccccc3)cc2)O1)c1ccc(Cl)cc1Cl
InChI Key InChIKey=FDZCPPVPOCCHSI-KAODMTDESA-N
Data  1 IC50
  Tab Delimited (TSV)   2D SDfile   Computed 3D by Vconf -m prep SDfile
Find this compound or compounds like it in BindingDB:
Activity Spreadsheet -- Enzyme Inhibition Constant Data from BindingDB
Found 1 hit for monomerid = 50522387
TargetSmoothened homolog(Mus musculus)
University Of Connecticut
Curated by ChEMBL
LigandPNGBDBM50522387(CHEMBL4538569)
Affinity DataIC50: >1.00E+4nM. Assay description: Inhibition of smo-mediated hedgehog signaling pathway in mouse ASZ001 cells assessed as decrease in Gli1 mRNA expression after 48 hrs by qPCR method
Ligand InfoPC cidPC sid
In DepthDetails ArticlePubMed