BDBM50523019 CHEMBL4440715
SMILES C[C@@H](O[C@H]1CC[C@@]2(COC(C)(C)C2)CC1)c1nc(no1)-c1cc(F)c(CS(C)(=O)=O)cc1F
InChI Key InChIKey=NZLIFYOTOWZDRW-SWHMAYCHSA-N
Data  1 EC50
  Tab Delimited (TSV)   2D SDfile   Computed 3D by Vconf -m prep SDfile
Find this compound or compounds like it in BindingDB:
Activity Spreadsheet -- Enzyme Inhibition Constant Data from BindingDB
Found 1 hit for monomerid = 50523019
TargetGlucose-dependent insulinotropic receptor(Homo sapiens (Human))
Japan Tobacco
Curated by ChEMBL
LigandPNGBDBM50523019(CHEMBL4440715)
Affinity DataEC50:  64nM. Assay description: Agonist activity at recombinant human GPR119 expressed in HEK293 cells assessed as increase in intracellular cAMP accumulation measured after 30 mins
Ligand InfoPC cidPC sid
In DepthDetails ArticlePubMed