BDBM50523510 CHEMBL4483379
SMILES O[C@@H]1[C@@H](COP(O)(=O)CP(O)(O)=O)O[C@H]([C@@H]1O)n1ccc(NC(=O)c2ccccc2)nc1=O
InChI Key InChIKey=ASYUOBCZEDPJCB-XKVFNRALSA-N
Data  3 KI  1 IC50  1 EC50
  Tab Delimited (TSV)   2D SDfile   Computed 3D by Vconf -m prep SDfile
Find this compound or compounds like it in BindingDB:
Activity Spreadsheet -- Enzyme Inhibition Constant Data from BindingDB
Found 5 hits for monomerid = 50523510
Target5'-nucleotidase(Homo sapiens (Human))
National Institute Of Diabetes And Digestive And Kidney Diseases
Curated by ChEMBL
LigandPNGBDBM50523510(CHEMBL4483379)
Affinity DataKi:  4.60nM. Assay description: Inhibition of recombinant human C-terminal His-tagged soluble form of CD73 expressed in baculovirus infected Sf9 insect cells using [2,8-3H]AMP as su...
Ligand InfoPC cidPC sid
In DepthDetails ArticlePubMed
Target5'-nucleotidase(Homo sapiens (Human))
National Institute Of Diabetes And Digestive And Kidney Diseases
Curated by ChEMBL
LigandPNGBDBM50523510(CHEMBL4483379)
Affinity DataKi:  5.70nM. Assay description: Inhibition of CD73 in human MDA-MB-231 cell membranes using [2,8-3H]AMP as substrate measured after 25 mins by scintillation counting method
Ligand InfoPC cidPC sid
In DepthDetails ArticlePubMed
Target5'-nucleotidase(Rattus norvegicus (Rat))
National Institute Of Diabetes And Digestive And Kidney Diseases
Curated by ChEMBL
LigandPNGBDBM50523510(CHEMBL4483379)
Affinity DataKi:  14nM. Assay description: Inhibition of recombinant rat C-terminal His-tagged soluble form of CD73 expressed in baculovirus infected Sf9 insect cells using [2,8-3H]AMP as subs...
Ligand InfoPC cidPC sid
In DepthDetails ArticlePubMed
TargetP2Y purinoceptor 14(Homo sapiens (Human))
National Institute Of Diabetes And Digestive And Kidney Diseases
Curated by ChEMBL
LigandPNGBDBM50523510(CHEMBL4483379)
Affinity DataIC50:  6.66E+3nM. Assay description: Displacement of 6-Amino-9-(2-carboxy-4-((6-(4-(4-(4-(4-(3-carboxy-6-(4-(trifluoromethyl)phenyl)-naphthalen-1-yl)phenyl)piperidin-1-yl)butyl)-1H-1,2,3...
Ligand InfoPC cidPC sid
In DepthDetails ArticlePubMed
TargetP2Y purinoceptor 6(Homo sapiens (Human))
National Institute Of Diabetes And Digestive And Kidney Diseases
Curated by ChEMBL
LigandPNGBDBM50523510(CHEMBL4483379)
Affinity DataEC50:  1.39E+3nM. Assay description: Agonist activity at human P2Y6 receptor expressed in human 1321N1 cells assessed as induction of calcium mobilization by calcium-4 dye based FLIPR as...
Ligand InfoPC cidPC sid
In DepthDetails ArticlePubMed