BDBM50523562 CHEMBL4474072
SMILES COC(=O)N[C@H](C(=O)N[C@@H](Cc1ccccc1)[C@H](CN(Cc1ccc(cc1)-c1ccccn1)NC(=O)[C@@H](NC(=O)OC)C(C)(C)C)OC(=O)[C@H](NC(=O)[C@H](N)C(C)C)C(C)C)C(C)(C)C
InChI Key InChIKey=JOFQASHOJZNENS-OYEZVYLDSA-N
Data  1 IC50
  Tab Delimited (TSV)   2D SDfile   Computed 3D by Vconf -m prep SDfile
Find this compound or compounds like it in BindingDB:
Activity Spreadsheet -- Enzyme Inhibition Constant Data from BindingDB
Found 1 hit for monomerid = 50523562
TargetProtease(Human immunodeficiency virus 1 (HIV-1))
TBA
Curated by ChEMBL
LigandPNGBDBM50523562(CHEMBL4474072)
Affinity DataIC50:  4nM. Assay description: Inhibition of HIV1 protease activity
Ligand InfoPC cidPC sid
In DepthDetails ArticlePubMed