BDBM50523564 CHEMBL4525849
SMILES COC(=O)N[C@H](C(=O)N[C@@H](Cc1ccccc1)[C@H](CN(Cc1ccc(cc1)-c1ccccn1)NC(=O)[C@@H](NC(=O)OC)C(C)(C)C)OC(=O)[C@H](C)N)C(C)(C)C
InChI Key InChIKey=FQBJREKJKHFABU-PICUCVSFSA-N
Data  1 IC50
  Tab Delimited (TSV)   2D SDfile   Computed 3D by Vconf -m prep SDfile
Find this compound or compounds like it in BindingDB:
Activity Spreadsheet -- Enzyme Inhibition Constant Data from BindingDB
Found 1 hit for monomerid = 50523564
TargetProtease(Human immunodeficiency virus 1 (HIV-1))
TBA
Curated by ChEMBL
LigandPNGBDBM50523564(CHEMBL4525849)
Affinity DataIC50:  4nM. Assay description: Inhibition of HIV1 protease activity
Ligand InfoKEGGPC cidPC sid
In DepthDetails ArticlePubMed