BDBM50523591 CHEMBL4516271
SMILES CC1(CCCN(C1)c1ccc(cn1)-c1ccc(cn1)-c1nc2cc(Cl)ccc2[nH]1)C(O)=O
InChI Key InChIKey=PRAHLUQGPUBTRW-UHFFFAOYSA-N
Data  1 KI  3 IC50
  Tab Delimited (TSV)   2D SDfile   Computed 3D by Vconf -m prep SDfile
Find this compound or compounds like it in BindingDB:
Activity Spreadsheet -- Enzyme Inhibition Constant Data from BindingDB
Found 4 hits for monomerid = 50523591
TargetPotassium voltage-gated channel subfamily H member 2(Homo sapiens (Human))
Merck
Curated by ChEMBL
LigandPNGBDBM50523591(CHEMBL4516271)
Affinity DataKi:  1.98E+3nM. Assay description: Inhibition of human ERG
Ligand InfoPC cidPC sid
In DepthDetails ArticlePubMed
TargetDiacylglycerol O-acyltransferase 1(Homo sapiens (Human))
Merck
Curated by ChEMBL
LigandPNGBDBM50523591(CHEMBL4516271)
Affinity DataIC50:  4.5nM. Assay description: Inhibition of human DGAT1
Ligand InfoPC cidPC sid
In DepthDetails ArticlePubMed
TargetSterol O-acyltransferase 1(Homo sapiens (Human))
Merck
Curated by ChEMBL
LigandPNGBDBM50523591(CHEMBL4516271)
Affinity DataIC50: >2.00E+3nM. Assay description: Inhibition of human ACAT1
Ligand InfoPC cidPC sid
In DepthDetails ArticlePubMed
TargetDiacylglycerol O-acyltransferase 1(Mus musculus (mouse))
Merck
Curated by ChEMBL
LigandPNGBDBM50523591(CHEMBL4516271)
Affinity DataIC50:  36nM. Assay description: Inhibition of mouse DGAT1
Ligand InfoPC cidPC sid
In DepthDetails ArticlePubMed