BDBM50523758 Phosphated riboflavin::Photrexa::RIBOFLAVIN 5'-PHOSPHATE SODIUM::Riboflavin 5''-phosphate sodium::Riboflavin sodium phosphate
SMILES O.O.[Na+].Cc1cc2nc3c(nc(=O)[nH]c3=O)n(C[C@H](O)[C@H](O)[C@H](O)COP(O)([O-])=O)c2cc1C
InChI Key InChIKey=LQVGUKOCMOKKJU-QPVGXXQTSA-M
Data  5 IC50
  Tab Delimited (TSV)   2D SDfile   Computed 3D by Vconf -m prep SDfile
Find this compound or compounds like it in BindingDB:
Activity Spreadsheet -- Enzyme Inhibition Constant Data from BindingDB
Found 5 hits for monomerid = 50523758
TargetThiosulfate sulfurtransferase(Homo sapiens)
Indiana University School Of Medicine
Curated by ChEMBL
LigandPNGBDBM50523758(Phosphated riboflavin | Photrexa | RIBOFLAVIN 5'-P...)
Affinity DataIC50:  380nM. Assay description: Inhibition of native rhodanese (unknown origin) assessed as reduction in rhodanese enzyme activity after 45 mins by Fe(SCN)3 dye based spectrometric ...
In DepthDetails ArticlePubMed
TargetCo-chaperonin GroES(Escherichia coli)
Indiana University School Of Medicine
Curated by ChEMBL
LigandPNGBDBM50523758(Phosphated riboflavin | Photrexa | RIBOFLAVIN 5'-P...)
Affinity DataIC50:  8.50E+4nM. Assay description: Inhibition of Escherichia coli GroEL expressed in Escherichia coliDH5alpha/Escherichia coli GroES expressed in Escherichia coli BL21 (DE3) assessed a...
In DepthDetails ArticlePubMed
TargetChaperonin GroEL(Escherichia coli)
Indiana University School Of Medicine
Curated by ChEMBL
LigandPNGBDBM50523758(Phosphated riboflavin | Photrexa | RIBOFLAVIN 5'-P...)
Affinity DataIC50: >2.50E+5nM. Assay description: Inhibition of ATPase activity of Escherichia coli GroEL expressed in Escherichia coliDH5alpha incubated for 60 mins using ATP by spectrometric analys...
In DepthDetails ArticlePubMed
TargetCo-chaperonin GroES(Escherichia coli)
Indiana University School Of Medicine
Curated by ChEMBL
LigandPNGBDBM50523758(Phosphated riboflavin | Photrexa | RIBOFLAVIN 5'-P...)
Affinity DataIC50:  770nM. Assay description: Inhibition of Escherichia coli GroEL expressed in Escherichia coli DH5alpha/Escherichia coli GroES expressed in Escherichia coli BL21 (DE3) assessed ...
In DepthDetails ArticlePubMed
Target60 kDa heat shock protein, mitochondrial(Homo sapiens)
Indiana University School Of Medicine
Curated by ChEMBL
LigandPNGBDBM50523758(Phosphated riboflavin | Photrexa | RIBOFLAVIN 5'-P...)
Affinity DataIC50:  8.00E+4nM. Assay description: Inhibition of human N-terminal octa-His-tagged HSP60 expressed in Escherichia coli Rosetta(DE3) pLysS/human HSP10 expressed in Escherichia coli Roset...
In DepthDetails ArticlePubMed