BDBM50524232 CHEMBL4551495
SMILES OC(c1ccc(c(F)c1)-c1ccc(NC(=O)CCCC2CCCCC2)cc1)(C(F)(F)F)C(F)(F)F
InChI Key InChIKey=OEMDEFBVFQUEJW-UHFFFAOYSA-N
Data  1 IC50
  Tab Delimited (TSV)   2D SDfile   Computed 3D by Vconf -m prep SDfile
Find this compound or compounds like it in BindingDB:
Activity Spreadsheet -- Enzyme Inhibition Constant Data from BindingDB
Found 1 hit for monomerid = 50524232
TargetNuclear receptor ROR-gamma(Homo sapiens (Human))
Chinese Academy Of Sciences
Curated by ChEMBL
LigandPNGBDBM50524232(CHEMBL4551495)
Affinity DataIC50:  1.08E+3nM. Assay description: Inverse agonist activity at Gal4-fused RORgamma LBD (unknown origin) expressed in 293T cells measured after 24 hrs by dual-luciferase reporter gene a...
Ligand InfoPC cidPC sid
In DepthDetails ArticlePubMed