BDBM50524253 CHEMBL4458996
SMILES COC(=O)CCCC(=O)Nc1ccc(cc1)-c1ccc(cc1F)C(O)(C(F)(F)F)C(F)(F)F
InChI Key InChIKey=VSPWMLMXHQKBHN-UHFFFAOYSA-N
Data  1 IC50
  Tab Delimited (TSV)   2D SDfile   Computed 3D by Vconf -m prep SDfile
Find this compound or compounds like it in BindingDB:
Activity Spreadsheet -- Enzyme Inhibition Constant Data from BindingDB
Found 1 hit for monomerid = 50524253
TargetNuclear receptor ROR-gamma(Homo sapiens (Human))
Chinese Academy Of Sciences
Curated by ChEMBL
LigandPNGBDBM50524253(CHEMBL4458996)
Affinity DataIC50:  930nM. Assay description: Inverse agonist activity at Gal4-fused RORgamma LBD (unknown origin) expressed in 293T cells measured after 24 hrs by dual-luciferase reporter gene a...
Ligand InfoPC cidPC sid
In DepthDetails ArticlePubMed