BDBM50524976 CHEMBL4435574
SMILES CC(C)S(=O)(=O)c1cn(-c2cc(C)[nH]n2)c2nc(N[C@@H](C)c3ccc(F)cn3)ccc12
InChI Key InChIKey=AVPFSEBOPFCRPI-AWEZNQCLSA-N
Data  3 IC50
  Tab Delimited (TSV)   2D SDfile   Computed 3D by Vconf -m prep SDfile
Find this compound or compounds like it in BindingDB:
Activity Spreadsheet -- Enzyme Inhibition Constant Data from BindingDB
Found 3 hits for monomerid = 50524976
TargetALK tyrosine kinase receptor(Homo sapiens (Human))
Takeda Pharmaceutical
Curated by ChEMBL
LigandPNGBDBM50524976(CHEMBL4435574)
Affinity DataIC50:  270nM. Assay description: Inhibition of recombinant human ALK expressed in HEK293 cells assessed as reduction in ALK autophosphorylation at Tyr1604 residue incubated for 60 mi...
Ligand InfoPC cidPC sid
In DepthDetails ArticlePubMed
TargetHigh affinity nerve growth factor receptor(Homo sapiens (Human))
Takeda Pharmaceutical
Curated by ChEMBL
LigandPNGBDBM50524976(CHEMBL4435574)
Affinity DataIC50:  1.70E+3nM. Assay description: Inhibition of N-terminal GST-tagged human TrkA kinase domain (436 to 790 residues) expressed in baculovirus expression system using biotin-poly-GT as...
Ligand InfoPC cidPC sid
In DepthDetails ArticlePubMed
TargetALK tyrosine kinase receptor(Homo sapiens (Human))
Takeda Pharmaceutical
Curated by ChEMBL
LigandPNGBDBM50524976(CHEMBL4435574)
Affinity DataIC50:  18nM. Assay description: Inhibition of human ALK kinase domain (1058 to 1620 residues) expressed in baculovirus expression system using biotin-poly-GT as substrate pre-incuba...
Ligand InfoPC cidPC sid
In DepthDetails ArticlePubMed