BDBM50526860 CHEMBL4554516
SMILES CC(C)C[C@@H]1NC(=O)[C@H](CO)NC(=O)[C@H](CO)NC(=O)[C@H](CNC(=O)[C@H](Cc2ccccc2)NC1=O)NC(=O)[C@H](C)NC(=O)[C@H](CC(N)=O)NC(=O)[C@@H](NC(=O)CN)C(C)C
InChI Key InChIKey=OFYAIKHWMVEMJU-NWHYMTRRSA-N
Data  1 IC50
  Tab Delimited (TSV)   2D SDfile   Computed 3D by Vconf -m prep SDfile
Find this compound or compounds like it in BindingDB:
Activity Spreadsheet -- Enzyme Inhibition Constant Data from BindingDB
Found 1 hit for monomerid = 50526860
TargetSensory histidine kinase DcuS(Staphylococcus aureus)
Veterans Affairs Eastern Colorado Health Care System
Curated by ChEMBL
LigandPNGBDBM50526860(CHEMBL4554516)
Affinity DataIC50: <1nM. Assay description: Inhibition of AgrC in mid-exponential phase Staphylococcus aureus RN6390B assessed as beta-lactamase activity incubated for 80 mins by spectrophotome...
Ligand InfoPC cidPC sid
In DepthDetails ArticlePubMed