BDBM50526861 CHEMBL2337554
SMILES [H][C@]1(NC(=O)[C@H](Cc2ccccc2)NC(=O)[C@H](CC(O)=O)NC(=O)[C@H](CSC(=O)[C@H](CCSC)NC1=O)NC(=O)[C@@H](NC(=O)[C@H](CO)NC(=O)[C@@H](N)Cc1ccc(O)cc1)[C@@H](C)O)[C@@H](C)CC
InChI Key InChIKey=QPIROHVZMLYRNN-YRNJLPRFSA-N
Data  2 IC50
  Tab Delimited (TSV)   2D SDfile   Computed 3D by Vconf -m prep SDfile
Find this compound or compounds like it in BindingDB:
Activity Spreadsheet -- Enzyme Inhibition Constant Data from BindingDB
Found 2 hits for monomerid = 50526861
TargetSensory histidine kinase DcuS(Staphylococcus aureus)
Veterans Affairs Eastern Colorado Health Care System
Curated by ChEMBL
LigandPNGBDBM50526861(CHEMBL2337554)
Affinity DataIC50:  3.40nM. Assay description: Inhibition of AgrC in mid-exponential phase Staphylococcus aureus SA502A assessed as beta-lactamase activity incubated for 80 mins by spectrophotomet...
Ligand InfoPC cidPC sid
In DepthDetails ArticlePubMed
TargetSensory histidine kinase DcuS(Staphylococcus aureus)
Veterans Affairs Eastern Colorado Health Care System
Curated by ChEMBL
LigandPNGBDBM50526861(CHEMBL2337554)
Affinity DataIC50:  3.10nM. Assay description: Inhibition of AgrC in mid-exponential phase Staphylococcus aureus RN8463 assessed as beta-lactamase activity incubated for 80 mins by spectrophotomet...
Ligand InfoPC cidPC sid
In DepthDetails ArticlePubMed