BDBM50528815 CHEMBL4468670
SMILES CCc1cnn2c(Nc3cccc(NC(=O)C=C)c3)cc(nc12)N1CCCC[C@H]1CCO
InChI Key InChIKey=CDCHESFKYUNJPV-FQEVSTJZSA-N
Data  3 IC50
  Tab Delimited (TSV)   2D SDfile   Computed 3D by Vconf -m prep SDfile
Find this compound or compounds like it in BindingDB:
Activity Spreadsheet -- Enzyme Inhibition Constant Data from BindingDB
Found 3 hits for monomerid = 50528815
TargetCyclin-T1/Cyclin-dependent kinase 9(Homo sapiens (Human))
Eli Lilly
Curated by ChEMBL
LigandPNGBDBM50528815(CHEMBL4468670)
Affinity DataIC50:  20nM. Assay description: Competitive irreversible inhibition of CDK9/cyclin T (unknown origin)
In DepthDetails ArticlePubMed
TargetCyclin-dependent kinase 2/G1/S-specific cyclin-E1(Homo sapiens (Human))
Eli Lilly
Curated by ChEMBL
LigandPNGBDBM50528815(CHEMBL4468670)
Affinity DataIC50:  932nM. Assay description: Competitive irreversible inhibition of CDK2/cyclin E (unknown origin)
In DepthDetails ArticlePubMed
LigandPNGBDBM50528815(CHEMBL4468670)
Affinity DataIC50:  1.20E+3nM. Assay description: Competitive irreversible inhibition of CDK7/cyclinH/MAT1 (unknown origin)
In DepthDetails ArticlePubMed