BDBM50529420 CHEMBL4546342
SMILES CC(C)c1c(cn[nH]c1=O)N1CCN(Cc2ccccc2C)C(=O)C1
InChI Key InChIKey=MMBVEHUVPBRIEU-UHFFFAOYSA-N
Data  1 IC50
  Tab Delimited (TSV)   2D SDfile   Computed 3D by Vconf -m prep SDfile
Find this compound or compounds like it in BindingDB:
Activity Spreadsheet -- Enzyme Inhibition Constant Data from BindingDB
Found 1 hit for monomerid = 50529420
TargetShort transient receptor potential channel 5(Homo sapiens (Human))
Goldfinch Bio
Curated by ChEMBL
LigandPNGBDBM50529420(CHEMBL4546342)
Affinity DataIC50:  2.40E+3nM. Assay description: Inhibition of rosiglitazone-activated human TRPC5 channel expressed in HEK293 cells assessed as reduction in Ca2+ current measured at +80 mV with hol...
Ligand InfoPC cidPC sid
In DepthDetails ArticlePubMed