BDBM50529446 CHEMBL4436512
SMILES C[C@H]1CN(Cc2ccccc2C)CCN1c1cn[nH]c(=O)c1Br
InChI Key InChIKey=HJKQOMMTUDYNHY-ZDUSSCGKSA-N
Data  1 IC50
  Tab Delimited (TSV)   2D SDfile   Computed 3D by Vconf -m prep SDfile
Find this compound or compounds like it in BindingDB:
Activity Spreadsheet -- Enzyme Inhibition Constant Data from BindingDB
Found 1 hit for monomerid = 50529446
TargetShort transient receptor potential channel 5(Homo sapiens (Human))
Goldfinch Bio
Curated by ChEMBL
LigandPNGBDBM50529446(CHEMBL4436512)
Affinity DataIC50: >3.00E+4nM. Assay description: Inhibition of rosiglitazone-activated human TRPC5 channel expressed in HEK293 cells assessed as reduction in Ca2+ current measured at +80 mV with hol...
Ligand InfoPC cidPC sid
In DepthDetails ArticlePubMed