BDBM50529496 CHEMBL4468796
SMILES [H][C@]12CC[C@]([H])(C[C@@H](C1)c1cccc(c1)C(N)=O)N2CCN(CC(CC)CC)C(=O)CO
InChI Key InChIKey=VTPKDSOSROLKKH-KOUNCHBCSA-N
Data  3 KI
  Tab Delimited (TSV)   2D SDfile   Computed 3D by Vconf -m prep SDfile
Find this compound or compounds like it in BindingDB:
Activity Spreadsheet -- Enzyme Inhibition Constant Data from BindingDB
Found 3 hits for monomerid = 50529496
TargetKappa-type opioid receptor(Cavia porcellus (domestic guinea pig))
Theravance Biopharma Us
Curated by ChEMBL
LigandPNGBDBM50529496(CHEMBL4468796)
Affinity DataKi:  0.126nM. Assay description: Displacement of [3H]-DPN from guinea pig kappa opioid receptor expressed in CHO-K1 cell membranes by radioligand binding assay
Ligand InfoPC cidPC sid
In DepthDetails ArticlePubMed
TargetMu-type opioid receptor(Homo sapiens (Human))
Theravance Biopharma Us
Curated by ChEMBL
LigandPNGBDBM50529496(CHEMBL4468796)
Affinity DataKi:  0.158nM. Assay description: Displacement of [3H]-DPN from recombinant human mu opioid receptor expressed in CHO-K1 cell membranes by radioligand binding assay
Ligand InfoPC cidPC sid
In DepthDetails ArticlePubMed
TargetDelta-type opioid receptor(Homo sapiens (Human))
Theravance Biopharma Us
Curated by ChEMBL
LigandPNGBDBM50529496(CHEMBL4468796)
Affinity DataKi:  13nM. Assay description: Displacement of [3H]-DPN from recombinant human delta opioid receptor expressed in CHO-K1 cell membranes by radioligand binding assay
Ligand InfoPC cidPC sid
In DepthDetails ArticlePubMed