BDBM50529504 CHEMBL3962054
SMILES NC(=O)c1cccc(c1)[C@@H]1C[C@@H]2CC[C@H](C1)N2CCN(CCCc1ccccc1)C(=O)CO
InChI Key InChIKey=RBEQOHMLGWWJOC-QEIWAGNOSA-N
Data  3 KI
  Tab Delimited (TSV)   2D SDfile   Computed 3D by Vconf -m prep SDfile
Find this compound or compounds like it in BindingDB:
Activity Spreadsheet -- Enzyme Inhibition Constant Data from BindingDB
Found 3 hits for monomerid = 50529504
TargetKappa-type opioid receptor(Cavia porcellus (domestic guinea pig))
Theravance Biopharma Us
Curated by ChEMBL
LigandPNGBDBM50529504(CHEMBL3962054)
Affinity DataKi:  0.501nM. Assay description: Displacement of [3H]-DPN from guinea pig kappa opioid receptor expressed in CHO-K1 cell membranes by radioligand binding assay
Ligand InfoPC cidPC sid
In DepthDetails ArticlePubMed
TargetMu-type opioid receptor(Homo sapiens (Human))
Theravance Biopharma Us
Curated by ChEMBL
LigandPNGBDBM50529504(CHEMBL3962054)
Affinity DataKi:  0.794nM. Assay description: Displacement of [3H]-DPN from recombinant human mu opioid receptor expressed in CHO-K1 cell membranes by radioligand binding assay
Ligand InfoPC cidPC sid
In DepthDetails ArticlePubMed
TargetDelta-type opioid receptor(Homo sapiens (Human))
Theravance Biopharma Us
Curated by ChEMBL
LigandPNGBDBM50529504(CHEMBL3962054)
Affinity DataKi:  32nM. Assay description: Displacement of [3H]-DPN from recombinant human delta opioid receptor expressed in CHO-K1 cell membranes by radioligand binding assay
Ligand InfoPC cidPC sid
In DepthDetails ArticlePubMed