BDBM5053 2,5-dicyano-N-[(2Z)-3,4-dimethyl-5-(propan-2-yl)-2,3-dihydro-1,3-thiazol-2-ylidene]benzene-1-sulfonamide::YM-228855::thiazolidenebenzenesulfonamide deriv.
SMILES CC(C)c1s\c(=N/S(=O)(=O)c2cc(ccc2C#N)C#N)n(C)c1C
InChI Key InChIKey=DCWVQZINYPVHTH-MNDPQUGUSA-N
Data  4 IC50
  Tab Delimited (TSV)   2D SDfile   Computed 3D by Vconf -m prep SDfile
Find this compound or compounds like it in BindingDB:
Activity Spreadsheet -- Enzyme Inhibition Constant Data from BindingDB
Found 4 hits for monomerid = 5053
TargetGag-Pol polyprotein [588-1027]/[588-1147](Human immunodeficiency virus type 1)
Yamanouchi Pharmaceutical
LigandPNGBDBM5053(2,5-dicyano-N-[(2Z)-3,4-dimethyl-5-(propan-2-yl)-2...)
Affinity DataIC50:  12nM. Assay description: The IC50 of reverse transcriptase is the concentration that inhibits 50% of recombinant HIV-1 RT RNA-directed DNA polymerase activity in vitro.
In DepthDetails ArticlePubMed
TargetReverse transcriptase protein(Human immunodeficiency virus 1)
Korea Institute Of Science And Technology
Curated by ChEMBL
LigandPNGBDBM5053(2,5-dicyano-N-[(2Z)-3,4-dimethyl-5-(propan-2-yl)-2...)
Affinity DataIC50:  3.98E+3nM. Assay description: Inhibition of HIV1 reverse transcriptase K103N mutant by HeLa-MAGI assay
In DepthDetails ArticlePubMed
TargetGag-Pol polyprotein [588-1127,Y768C]/[588-1147,Y768C](Human immunodeficiency virus type 1)
Yamanouchi Pharmaceutical
LigandPNGBDBM5053(2,5-dicyano-N-[(2Z)-3,4-dimethyl-5-(propan-2-yl)-2...)
Affinity DataIC50:  470nM. Assay description: The IC50 of reverse transcriptase is the concentration that inhibits 50% of recombinant HIV-1 RT RNA-directed DNA polymerase activity in vitro.
In DepthDetails ArticlePubMed
TargetGag-Pol polyprotein [588-1027,K690N]/[588-1147,K690N](Human immunodeficiency virus type 1)
Yamanouchi Pharmaceutical
LigandPNGBDBM5053(2,5-dicyano-N-[(2Z)-3,4-dimethyl-5-(propan-2-yl)-2...)
Affinity DataIC50:  4.10E+3nM. Assay description: The IC50 of reverse transcriptase is the concentration that inhibits 50% of recombinant HIV-1 RT RNA-directed DNA polymerase activity in vitro.
In DepthDetails ArticlePubMed