BDBM50531785 CHEMBL4543226::US11530198, Example 69
SMILES Cc1ncc(cn1)-c1cccc(c1)N1CCN(CC1)c1cnc(N)nc1N
InChI Key InChIKey=NLZHOJOCWCLWFT-UHFFFAOYSA-N
Data  6 IC50
PDB links: 1 PDB ID matches this monomer.
  Tab Delimited (TSV)   2D SDfile   Computed 3D by Vconf -m prep SDfile
Find this compound or compounds like it in BindingDB:
Activity Spreadsheet -- Enzyme Inhibition Constant Data from BindingDB
Found 6 hits for monomerid = 50531785
TargetDihydrofolate reductase(Homo sapiens (Human))
Vyera Pharmaceuticals
Curated by ChEMBL
LigandPNGBDBM50531785(CHEMBL4543226 | US11530198, Example 69)
Affinity DataIC50:  935nM. Assay description: Inhibition of human DHFR expressed in Escherichia coli BL21 competent cells using DHF as substrate preincubated for 15 mins followed by substrate and...
Ligand InfoPC cidPC sidPDB
In DepthDetails ArticlePubMed
TargetBifunctional dihydrofolate reductase-thymidylate synthase(Toxoplasma gondii)
Vyera Pharmaceuticals
Curated by ChEMBL
LigandPNGBDBM50531785(CHEMBL4543226 | US11530198, Example 69)
Affinity DataIC50:  4nM. Assay description: Inhibition of Toxoplasma gondii DHFR-TS expressed in Escherichia coli BL21 competent cells using DHF as substrate preincubated for 15 mins followed b...
Ligand InfoPC cidPC sidPDB
TargetBifunctional dihydrofolate reductase-thymidylate synthase(Trypanosoma brucei brucei)
Vyera Pharmaceuticals
US Patent
LigandPNGBDBM50531785(CHEMBL4543226 | US11530198, Example 69)
Affinity DataIC50:  2nM. Assay description: TBD
Ligand InfoPC cidPC sidPDB
In DepthDetails US Patent
TargetBifunctional dihydrofolate reductase-thymidylate synthase(Toxoplasma gondii)
Vyera Pharmaceuticals
Curated by ChEMBL
LigandPNGBDBM50531785(CHEMBL4543226 | US11530198, Example 69)
Affinity DataIC50:  4.47nM. Assay description: TBD
Ligand InfoPC cidPC sidPDB
TargetDihydrofolate reductase(Homo sapiens (Human))
Vyera Pharmaceuticals
Curated by ChEMBL
LigandPNGBDBM50531785(CHEMBL4543226 | US11530198, Example 69)
Affinity DataIC50:  794nM. Assay description: TBD
Ligand InfoPC cidPC sidPDB
In DepthDetails US Patent
TargetDihydrofolate reductase(Homo sapiens (Human))
Vyera Pharmaceuticals
Curated by ChEMBL
LigandPNGBDBM50531785(CHEMBL4543226 | US11530198, Example 69)
Affinity DataIC50:  1.02E+3nM. Assay description: TBD
Ligand InfoPC cidPC sidPDB
In DepthDetails US Patent