BDBM50531786 CHEMBL4573445::US11530198, Example 74
SMILES Nc1ncc(N2CCN(CC2)c2cccc(c2)-c2cncnc2)c(N)n1
InChI Key InChIKey=JYHQPYJPVMGKIX-UHFFFAOYSA-N
Data  6 IC50
  Tab Delimited (TSV)   2D SDfile   Computed 3D by Vconf -m prep SDfile
Find this compound or compounds like it in BindingDB:
Activity Spreadsheet -- Enzyme Inhibition Constant Data from BindingDB
Found 6 hits for monomerid = 50531786
TargetDihydrofolate reductase(Homo sapiens (Human))
Vyera Pharmaceuticals
Curated by ChEMBL
LigandPNGBDBM50531786(CHEMBL4573445 | US11530198, Example 74)
Affinity DataIC50:  1.43E+3nM. Assay description: Inhibition of human DHFR expressed in Escherichia coli BL21 competent cells using DHF as substrate preincubated for 15 mins followed by substrate and...
Ligand InfoPC cidPC sid
In DepthDetails ArticlePubMed
TargetBifunctional dihydrofolate reductase-thymidylate synthase(Toxoplasma gondii)
Vyera Pharmaceuticals
Curated by ChEMBL
LigandPNGBDBM50531786(CHEMBL4573445 | US11530198, Example 74)
Affinity DataIC50:  4.80nM. Assay description: Inhibition of Toxoplasma gondii DHFR-TS expressed in Escherichia coli BL21 competent cells using DHF as substrate preincubated for 15 mins followed b...
Ligand InfoPC cidPC sid
In DepthDetails ArticlePubMed
TargetBifunctional dihydrofolate reductase-thymidylate synthase(Trypanosoma brucei brucei)
Vyera Pharmaceuticals
US Patent
LigandPNGBDBM50531786(CHEMBL4573445 | US11530198, Example 74)
Affinity DataIC50:  5.62nM. Assay description: TBD
Ligand InfoPC cidPC sid
In DepthDetails US Patent
TargetBifunctional dihydrofolate reductase-thymidylate synthase(Toxoplasma gondii)
Vyera Pharmaceuticals
Curated by ChEMBL
LigandPNGBDBM50531786(CHEMBL4573445 | US11530198, Example 74)
Affinity DataIC50:  4.79nM. Assay description: TBD
Ligand InfoPC cidPC sid
In DepthDetails US Patent
TargetDihydrofolate reductase(Homo sapiens (Human))
Vyera Pharmaceuticals
Curated by ChEMBL
LigandPNGBDBM50531786(CHEMBL4573445 | US11530198, Example 74)
Affinity DataIC50:  3.09E+3nM. Assay description: TBD
Ligand InfoPC cidPC sid
In DepthDetails US Patent
TargetDihydrofolate reductase(Homo sapiens (Human))
Vyera Pharmaceuticals
Curated by ChEMBL
LigandPNGBDBM50531786(CHEMBL4573445 | US11530198, Example 74)
Affinity DataIC50:  1.45E+3nM. Assay description: TBD
Ligand InfoPC cidPC sid
In DepthDetails US Patent