BDBM50533464 CHEMBL4457828
SMILES [H][C@@]12[C@@H](C(=O)Nc3ccc(cn3)C(O)=O)[C@]1(C)Cc1ccccc21
InChI Key InChIKey=WKEZJMJNKWJEEV-RVKKMQEKSA-N
Data  1 Kd
  Tab Delimited (TSV)   2D SDfile   Computed 3D by Vconf -m prep SDfile
Find this compound or compounds like it in BindingDB:
Activity Spreadsheet -- Enzyme Inhibition Constant Data from BindingDB
Found 1 hit for monomerid = 50533464
TargetHexokinase-4(Homo sapiens (Human))
Istituto Italiano Di Tecnologia
Curated by ChEMBL
LigandPNGBDBM50533464(CHEMBL4457828)
Affinity DataKd:  4.40E+3nM. Assay description: Displacement of TAFMT from human pancreatic N-terminal His6-tagged glucokinase isoform 1 expressed in Escherichia coli BL21(DE3) by stopped-flow fluo...
Ligand InfoPC cidPC sid
In DepthDetails ArticlePubMed