BDBM50533547 CHEMBL4537339
SMILES CS(=O)(=O)NC(=O)c1cc(F)c(Oc2ccc(Cl)c(Cl)c2)cc1F
InChI Key InChIKey=KASGDBJYKOICKB-UHFFFAOYSA-N
Data  1 KI  2 IC50
  Tab Delimited (TSV)   2D SDfile   Computed 3D by Vconf -m prep SDfile
Find this compound or compounds like it in BindingDB:
Activity Spreadsheet -- Enzyme Inhibition Constant Data from BindingDB
Found 3 hits for monomerid = 50533547
TargetPotassium voltage-gated channel subfamily H member 2(Homo sapiens (Human))
Amgen
Curated by ChEMBL
LigandPNGBDBM50533547(CHEMBL4537339)
Affinity DataKi: >3.00E+4nM. Assay description: Displacement of [3H]dofetilide from human ERG expressed in HEK293 cells after 45 mins by scintillation counting analysis
Ligand InfoPC cidPC sid
In DepthDetails ArticlePubMed
TargetSodium channel protein type 5 subunit alpha(Homo sapiens (Human))
Amgen
Curated by ChEMBL
LigandPNGBDBM50533547(CHEMBL4537339)
Affinity DataIC50: >3.00E+4nM. Assay description: Inhibition of human Nav1.5 expressed in HEK293 cells incubated for 3 to 5 mins at -50 mV holding potential by electrophysiology assay
Ligand InfoPC cidPC sid
In DepthDetails ArticlePubMed
TargetSodium channel protein type 9 subunit alpha(Homo sapiens (Human))
Amgen
Curated by ChEMBL
LigandPNGBDBM50533547(CHEMBL4537339)
Affinity DataIC50:  740nM. Assay description: Inhibition of human Nav1.7 expressed in HEK293 cells incubated for 3 to 5 mins at -125 mV holding potential by electrophysiology assay
Ligand InfoPC cidPC sid
In DepthDetails ArticlePubMed