BDBM50533727 CHEMBL4456392
SMILES Cl.Cn1cc(nn1)S(=O)(=O)N1CCN(CC1)C1(CNC(=O)c2ccc(F)cc2Cl)CCC(F)(F)CC1
InChI Key InChIKey=FCTHJCBXNIEIDX-UHFFFAOYSA-N
Data  2 IC50
  Tab Delimited (TSV)   2D SDfile   Computed 3D by Vconf -m prep SDfile
Find this compound or compounds like it in BindingDB:
Activity Spreadsheet -- Enzyme Inhibition Constant Data from BindingDB
Found 2 hits for monomerid = 50533727
TargetSodium- and chloride-dependent glycine transporter 1(Homo sapiens (Human))
Amri
Curated by ChEMBL
LigandPNGBDBM50533727(CHEMBL4456392)
Affinity DataIC50:  1.10nM. Assay description: Inhibition of glycine transporter-1B in human JAR cells assessed as reduction in [14C]glycine uptake preincubated for 10 mins followed by [14C]glycin...
Ligand InfoPC cidPC sid
In DepthDetails ArticlePubMed
TargetSodium- and chloride-dependent glycine transporter 2(Homo sapiens (Human))
Amri
Curated by ChEMBL
LigandPNGBDBM50533727(CHEMBL4456392)
Affinity DataIC50: >7.50E+4nM. Assay description: Inhibition of human glycine transporter-2 expressed in HEK293 cells assessed as reduction in [14C]glycine uptake preincubated for 10 mins followed by...
Ligand InfoPC cidPC sid
In DepthDetails ArticlePubMed