BDBM50535185 CHEMBL4464968
SMILES CC(C)[C@@H]1NC(=O)[C@H](CSSC[C@H](NC(=O)[C@H](CO)NC(=O)[C@H](Cc2c[nH]c3ccccc23)NC(=O)[C@H](CO)NC(=O)CCNC(=O)[C@H](CCCNC(N)=N)NC(=O)[C@H](Cc2ccc(O)cc2)NC1=O)C(N)=O)NC(=O)[C@H](Cc1ccc(O)cc1)NC(=O)[C@@H]1CCCN1C(=O)CCN
InChI Key InChIKey=FHASZHUQQPMTFZ-WSCXZWOYSA-N
Data  3 IC50  1 Kd
  Tab Delimited (TSV)   2D SDfile   Computed 3D by Vconf -m prep SDfile
Find this compound or compounds like it in BindingDB:
Activity Spreadsheet -- Enzyme Inhibition Constant Data from BindingDB
Found 4 hits for monomerid = 50535185
TargetEphrin type-A receptor 4(Homo sapiens (Human))
The Scripps Research Institute
Curated by ChEMBL
LigandPNGBDBM50535185(CHEMBL4464968)
Affinity DataIC50:  17nM. Assay description: Antagonist activity against human EphA4 receptor assessed as inhibition of binding of alkaline phosphatase-fused ephrin-A5 to immobilized EphA4 Fc by...
Ligand InfoPC cidPC sid
In DepthDetails ArticlePubMed
TargetEphrin type-A receptor 4(Homo sapiens (Human))
The Scripps Research Institute
Curated by ChEMBL
LigandPNGBDBM50535185(CHEMBL4464968)
Affinity DataKd:  27nM. Assay description: Binding affinity to 6His-tagged EphA4 C204A mutant (29 to 104 residues) (unknown origin) expressed in Escherichia coli Origami 2 (DE3) by isothermal ...
Ligand InfoPC cidPC sid
In DepthDetails ArticlePubMed
TargetEphrin type-A receptor 4(Mus musculus)
The Scripps Research Institute
Curated by ChEMBL
LigandPNGBDBM50535185(CHEMBL4464968)
Affinity DataIC50:  20nM. Assay description: Antagonist activity against mouse EphA4 receptor assessed as inhibition of binding of alkaline phosphatase-fused ephrin-A5 to immobilized EphA4 Fc by...
Ligand InfoPC cidPC sid
In DepthDetails ArticlePubMed
TargetEphrin type-A receptor 4(Homo sapiens (Human))
The Scripps Research Institute
Curated by ChEMBL
LigandPNGBDBM50535185(CHEMBL4464968)
Affinity DataIC50:  240nM. Assay description: Inhibition of 0.5 ug/ml ephrinA5-induced human EphA4 tyrosine phosphorylation expressed in HEK293AD cells preincubated for 20 mins followed by ephrin...
Ligand InfoPC cidPC sid
In DepthDetails ArticlePubMed