BDBM50536794 CHEMBL4573492
SMILES C[C@H]1COC[C@H](c2ccccc2)S(=O)(=O)N1Cc1ccc(cc1F)N1CCN(CC1)C(C)=O
InChI Key InChIKey=LUFNTVBOMKDTDQ-MHECFPHRSA-N
Data  4 EC50
  Tab Delimited (TSV)   2D SDfile   Computed 3D by Vconf -m prep SDfile
Find this compound or compounds like it in BindingDB:
Activity Spreadsheet -- Enzyme Inhibition Constant Data from BindingDB
Found 4 hits for monomerid = 50536794
TargetNuclear receptor ROR-gamma(Homo sapiens (Human))
Genentech
Curated by ChEMBL
LigandPNGBDBM50536794(CHEMBL4573492)
Affinity DataEC50:  64nM. Assay description: Inverse agonist activity at GAL4-fused human RORc expressed in HEK293 cells assessed as activation of basal transcriptional activity by dual-glo luci...
Ligand InfoPC cidPC sid
In DepthDetails ArticlePubMed
TargetNuclear receptor ROR-beta(Homo sapiens (Human))
Genentech
Curated by ChEMBL
LigandPNGBDBM50536794(CHEMBL4573492)
Affinity DataEC50: >1.00E+4nM. Assay description: Inverse agonist activity at GAL4-fused human RORb expressed in HEK293 cells assessed as activation of basal transcriptional activity by dual-glo luci...
Ligand InfoPC cidPC sid
In DepthDetails ArticlePubMed
TargetNuclear receptor ROR-gamma(Homo sapiens (Human))
Genentech
Curated by ChEMBL
LigandPNGBDBM50536794(CHEMBL4573492)
Affinity DataEC50:  8nM. Assay description: Inverse agonist activity at human RORc-LBD assessed as inhibition of SRC1 co-activator peptide recruitment by FRET assay
Ligand InfoPC cidPC sid
In DepthDetails ArticlePubMed
TargetNuclear receptor ROR-alpha(Homo sapiens (Human))
Genentech
Curated by ChEMBL
LigandPNGBDBM50536794(CHEMBL4573492)
Affinity DataEC50: >1.00E+4nM. Assay description: Inverse agonist activity at GAL4-fused human RORa expressed in HEK293 cells assessed as activation of basal transcriptional activity by dual-glo luci...
Ligand InfoPC cidPC sid
In DepthDetails ArticlePubMed