BDBM50536803 CHEMBL4547236
SMILES COc1ccccc1[C@H]1CC[C@H](C)N(Cc2ccc(cc2F)N2CCN(CC2)C(C)=O)S1(=O)=O
InChI Key InChIKey=LNOVHGLHJDEANG-AVRWGWEMSA-N
Data  1 EC50
  Tab Delimited (TSV)   2D SDfile   Computed 3D by Vconf -m prep SDfile
Find this compound or compounds like it in BindingDB:
Activity Spreadsheet -- Enzyme Inhibition Constant Data from BindingDB
Found 1 hit for monomerid = 50536803
TargetNuclear receptor ROR-gamma(Homo sapiens (Human))
Genentech
Curated by ChEMBL
LigandPNGBDBM50536803(CHEMBL4547236)
Affinity DataEC50:  94nM. Assay description: Inverse agonist activity at human RORc-LBD assessed as inhibition of SRC1 co-activator peptide recruitment by FRET assay
Ligand InfoPC cidPC sid
In DepthDetails ArticlePubMed