BDBM50539088 CHEMBL4635906
SMILES CN1C(=O)N(CC(=O)NCCCCCCC(=O)Nc2cccc3C(=O)N(Cc23)C2CCC(=O)NC2=O)C(c2ccccc2)c2cc(ccc12)-c1c(C)noc1C
InChI Key InChIKey=UKVPRMNJZZUJHF-UHFFFAOYSA-N
Data  1 IC50
  Tab Delimited (TSV)   2D SDfile   Computed 3D by Vconf -m prep SDfile
Find this compound or compounds like it in BindingDB:
Activity Spreadsheet -- Enzyme Inhibition Constant Data from BindingDB
Found 1 hit for monomerid = 50539088
TargetBromodomain-containing protein 4(Homo sapiens (Human))
China Pharmaceutical University
Curated by ChEMBL
LigandPNGBDBM50539088(CHEMBL4635906)
Affinity DataIC50:  81nM. Assay description: Inhibition of recombinant human GST-tagged BRD4 BD1 (44 to 168 residues) expressed in Escherichia coli incubated for 60 mins by alphascreen assay
Ligand InfoPC cidPC sid
In DepthDetails ArticlePubMed