BDBM50539100 CHEMBL4636103
SMILES CN1C(=O)N(Cc2cn(CCOCCOCCOCC(=O)Nc3cccc4C(=O)N(C5CCC(=O)NC5=O)C(=O)c34)nn2)C(c2ccccc2)c2cc(ccc12)-c1c(C)noc1C
InChI Key InChIKey=SREGPLSSQYMUCF-UHFFFAOYSA-N
Data  1 IC50
  Tab Delimited (TSV)   2D SDfile   Computed 3D by Vconf -m prep SDfile
Find this compound or compounds like it in BindingDB:
Activity Spreadsheet -- Enzyme Inhibition Constant Data from BindingDB
Found 1 hit for monomerid = 50539100
TargetBromodomain-containing protein 4(Homo sapiens (Human))
China Pharmaceutical University
Curated by ChEMBL
LigandPNGBDBM50539100(CHEMBL4636103)
Affinity DataIC50:  69nM. Assay description: Inhibition of recombinant human GST-tagged BRD4 BD1 (44 to 168 residues) expressed in Escherichia coli incubated for 60 mins by alphascreen assay
Ligand InfoPC cidPC sid
In DepthDetails ArticlePubMed