BDBM50539540 CHEMBL4644910
SMILES CCOC(=O)Cc1nn(CNC(=O)CCCN2CCN(CC2)c2ccc(C)c(C)c2)c(=O)c2cc(F)ccc12
InChI Key InChIKey=DVFJGSIHKLSINR-UHFFFAOYSA-N
Data  3 IC50
  Tab Delimited (TSV)   2D SDfile   Computed 3D by Vconf -m prep SDfile
Find this compound or compounds like it in BindingDB:
Activity Spreadsheet -- Enzyme Inhibition Constant Data from BindingDB
Found 3 hits for monomerid = 50539540
Target5-hydroxytryptamine receptor 2A(Homo sapiens (Human))
Korea Institute Of Science And Technology
Curated by ChEMBL
LigandPNGBDBM50539540(CHEMBL4644910)
Affinity DataIC50:  12nM. Assay description: Displacement of [3H]ketanserin from 5HT2A receptor (unknown origin) by cell based radioligand competitive binding analysis
Ligand InfoPC cidPC sid
In DepthDetails ArticlePubMed
TargetSodium-dependent serotonin transporter(Homo sapiens (Human))
Korea Institute Of Science And Technology
Curated by ChEMBL
LigandPNGBDBM50539540(CHEMBL4644910)
Affinity DataIC50:  210nM. Assay description: Displacement of [3H]imipramine from SERT receptor (unknown origin) by cell based radioligand competitive binding analysis
Ligand InfoPC cidPC sid
In DepthDetails ArticlePubMed
Target5-hydroxytryptamine receptor 2C(Homo sapiens (Human))
Korea Institute Of Science And Technology
Curated by ChEMBL
LigandPNGBDBM50539540(CHEMBL4644910)
Affinity DataIC50:  6nM. Assay description: Displacement of [3H]mesulergine from 5-HT2C receptor (unknown origin) by cell based radioligand competitive binding analysis
Ligand InfoPC cidPC sid
In DepthDetails ArticlePubMed