BDBM50540491 CHEMBL4649224
SMILES CN(C)CC1COCC(O1)(C1CCCCC1)c1ccccc1
InChI Key InChIKey=UOKGNINOAYOIDX-UHFFFAOYSA-N
Data  5 KI
  Tab Delimited (TSV)   2D SDfile   Computed 3D by Vconf -m prep SDfile
Find this compound or compounds like it in BindingDB:
Activity Spreadsheet -- Enzyme Inhibition Constant Data from BindingDB
Found 5 hits for monomerid = 50540491
TargetMuscarinic acetylcholine receptor M1(Homo sapiens (Human))
Universit£
Curated by ChEMBL
LigandPNGBDBM50540491(CHEMBL4649224)
Affinity DataKi:  1.40nM. Assay description: Displacement of [3H]NMS from human recombinant muscarinic receptor M1 expressed in CHO-K1 cell membranes incubated for 2 hrs by scintillation countin...
Ligand InfoPC cidPC sid
In DepthDetails ArticlePubMed
TargetMuscarinic acetylcholine receptor M3(Homo sapiens (Human))
Universit£
Curated by ChEMBL
LigandPNGBDBM50540491(CHEMBL4649224)
Affinity DataKi:  1.90nM. Assay description: Displacement of [3H]NMS from human recombinant muscarinic receptor M3 expressed in CHO-K1 cell membranes incubated for 2 hrs by scintillation countin...
Ligand InfoPC cidPC sid
In DepthDetails ArticlePubMed
TargetMuscarinic acetylcholine receptor M5(Homo sapiens (Human))
Universit£
Curated by ChEMBL
LigandPNGBDBM50540491(CHEMBL4649224)
Affinity DataKi:  2.40nM. Assay description: Displacement of [3H]NMS from human recombinant muscarinic receptor M5 expressed in CHO-K1 cell membranes incubated for 2 hrs by scintillation countin...
Ligand InfoPC cidPC sid
In DepthDetails ArticlePubMed
TargetMuscarinic acetylcholine receptor M4(Homo sapiens (Human))
Universit£
Curated by ChEMBL
LigandPNGBDBM50540491(CHEMBL4649224)
Affinity DataKi:  2.40nM. Assay description: Displacement of [3H]NMS from human recombinant muscarinic receptor M4 expressed in CHO-K1 cell membranes incubated for 2 hrs by scintillation countin...
Ligand InfoPC cidPC sid
In DepthDetails ArticlePubMed
TargetMuscarinic acetylcholine receptor M2(Homo sapiens (Human))
Universit£
Curated by ChEMBL
LigandPNGBDBM50540491(CHEMBL4649224)
Affinity DataKi:  13nM. Assay description: Displacement of [3H]NMS from human recombinant muscarinic receptor M2 expressed in CHO-K1 cell membranes incubated for 2 hrs by scintillation countin...
Ligand InfoPC cidPC sid
In DepthDetails ArticlePubMed