BDBM50540617 CHEMBL4649348
SMILES [H][C@]12CO[C@@]([H])(O1)[C@@H](O)[C@@]([H])([C@@H]2O)[C@@]1([H])[C@@H](O)[C@]2([H])OC(C)(C)O[C@]2([H])CN1CCCCCCn1cc(CNc2ccc(cc2)S(N)(=O)=O)nn1
InChI Key InChIKey=MWZLBQWPJOSIAH-MAEDULGDSA-N
Data  10 KI
  Tab Delimited (TSV)   2D SDfile   Computed 3D by Vconf -m prep SDfile
Find this compound or compounds like it in BindingDB:
Activity Spreadsheet -- Enzyme Inhibition Constant Data from BindingDB
Found 10 hits for monomerid = 50540617
TargetCarbonic anhydrase 7(Homo sapiens (Human))
Universit£
Curated by ChEMBL
LigandPNGBDBM50540617(CHEMBL4649348)
Affinity DataKi:  31nM. Assay description: Inhibition of recombinant human carbonic anhydrase 7 preincubated with enzyme for 15 mins by phenol red dye based stopped flow CO2 hydration assay
Ligand InfoPC cidPC sid
In DepthDetails ArticlePubMed
TargetCarbonic anhydrase 5A, mitochondrial(Homo sapiens (Human))
Universit£
Curated by ChEMBL
LigandPNGBDBM50540617(CHEMBL4649348)
Affinity DataKi:  34nM. Assay description: Inhibition of recombinant human carbonic anhydrase 5A preincubated with enzyme for 15 mins by phenol red dye based stopped flow CO2 hydration assay
Ligand InfoPC cidPC sid
In DepthDetails ArticlePubMed
TargetCarbonic anhydrase 9(Homo sapiens (Human))
Universit£
Curated by ChEMBL
LigandPNGBDBM50540617(CHEMBL4649348)
Affinity DataKi:  36nM. Assay description: Inhibition of recombinant human carbonic anhydrase 9 preincubated with enzyme for 15 mins by phenol red dye based stopped flow CO2 hydration assay
Ligand InfoPC cidPC sid
In DepthDetails ArticlePubMed
TargetCarbonic anhydrase 13(Homo sapiens (Human))
Universit£
Curated by ChEMBL
LigandPNGBDBM50540617(CHEMBL4649348)
Affinity DataKi:  429nM. Assay description: Inhibition of recombinant human carbonic anhydrase 13 preincubated with enzyme for 15 mins by phenol red dye based stopped flow CO2 hydration assay
Ligand InfoPC cidPC sid
In DepthDetails ArticlePubMed
TargetCarbonic anhydrase 6(Homo sapiens (Human))
Universit£
Curated by ChEMBL
LigandPNGBDBM50540617(CHEMBL4649348)
Affinity DataKi:  543nM. Assay description: Inhibition of recombinant human carbonic anhydrase 6 preincubated with enzyme for 15 mins by phenol red dye based stopped flow CO2 hydration assay
Ligand InfoPC cidPC sid
In DepthDetails ArticlePubMed
TargetCarbonic anhydrase 4(Homo sapiens (Human))
Universit£
Curated by ChEMBL
LigandPNGBDBM50540617(CHEMBL4649348)
Affinity DataKi:  659nM. Assay description: Inhibition of recombinant human carbonic anhydrase 4 preincubated with enzyme for 15 mins by phenol red dye based stopped flow CO2 hydration assay
Ligand InfoPC cidPC sid
In DepthDetails ArticlePubMed
TargetCarbonic anhydrase 12(Homo sapiens (Human))
Universit£
Curated by ChEMBL
LigandPNGBDBM50540617(CHEMBL4649348)
Affinity DataKi:  770nM. Assay description: Inhibition of recombinant human carbonic anhydrase 12 preincubated with enzyme for 15 mins by phenol red dye based stopped flow CO2 hydration assay
Ligand InfoPC cidPC sid
In DepthDetails ArticlePubMed
TargetCarbonic anhydrase 2(Homo sapiens (Human))
Universit£
Curated by ChEMBL
LigandPNGBDBM50540617(CHEMBL4649348)
Affinity DataKi:  801nM. Assay description: Inhibition of recombinant human carbonic anhydrase 2 preincubated with enzyme for 15 mins by phenol red dye based stopped flow CO2 hydration assay
Ligand InfoPC cidPC sid
In DepthDetails ArticlePubMed
TargetCarbonic anhydrase 1(Homo sapiens (Human))
Universit£
Curated by ChEMBL
LigandPNGBDBM50540617(CHEMBL4649348)
Affinity DataKi:  956nM. Assay description: Inhibition of recombinant human carbonic anhydrase 1 preincubated with enzyme for 15 mins by phenol red dye based stopped flow CO2 hydration assay
Ligand InfoPC cidPC sid
In DepthDetails ArticlePubMed
TargetCarbonic anhydrase 5B, mitochondrial(Homo sapiens (Human))
Universit£
Curated by ChEMBL
LigandPNGBDBM50540617(CHEMBL4649348)
Affinity DataKi:  4.35E+3nM. Assay description: Inhibition of recombinant human carbonic anhydrase 5B preincubated with enzyme for 15 mins by phenol red dye based stopped flow CO2 hydration assay
Ligand InfoPC cidPC sid
In DepthDetails ArticlePubMed