BDBM50543055 CHEMBL4647772
SMILES OC(=O)c1cnn(c1)-c1nc2ccn(Cc3ccc(cc3)-c3ccccc3)c2c(=O)[nH]1
InChI Key InChIKey=KROTXUCPWRNZDM-UHFFFAOYSA-N
Data  1 IC50
  Tab Delimited (TSV)   2D SDfile   Computed 3D by Vconf -m prep SDfile
Find this compound or compounds like it in BindingDB:
Activity Spreadsheet -- Enzyme Inhibition Constant Data from BindingDB
Found 1 hit for monomerid = 50543055
TargetEgl nine homolog 1(Homo sapiens (Human))
Mitsubishi Tanabe Pharma
Curated by ChEMBL
LigandPNGBDBM50543055(CHEMBL4647772)
Affinity DataIC50:  51nM. Assay description: Inhibition of HIF-PHD2 (unknown origin) using FAM-HIF2alpha peptide incubated for 20 to 40 mins by fluorescence polarization assay
Ligand InfoPC cidPC sid
In DepthDetails ArticlePubMed