BDBM50543137 CHEMBL4634860
SMILES Cc1cc(cnc1OCC12CCC(N)(CC1)CC2)-c1ccnc2[nH]ncc12
InChI Key InChIKey=DWTASGLRYAARGP-UHFFFAOYSA-N
Data  6 IC50
  Tab Delimited (TSV)   2D SDfile   Computed 3D by Vconf -m prep SDfile
Find this compound or compounds like it in BindingDB:
Activity Spreadsheet -- Enzyme Inhibition Constant Data from BindingDB
Found 6 hits for monomerid = 50543137
TargetToll-like receptor 8(Homo sapiens (Human))
Genomics Institute Of The Novartis Research Foundation
Curated by ChEMBL
LigandPNGBDBM50543137(CHEMBL4634860)
Affinity DataIC50:  68nM. Assay description: Displacement of 2-((1E,3E,5E)-5-(3,3-Dimethyl-1-(6-((4-(((3-methyl-5-(1H-pyrazolo[3,4-b]pyridin-4-yl)pyridin-2-yl)oxy)methyl)bicyclo[2.2.2]octan-1-yl...
Ligand InfoPC cidPC sid
In DepthDetails ArticlePubMed
TargetToll-like receptor 7(Mus musculus)
Genomics Institute Of The Novartis Research Foundation
Curated by ChEMBL
LigandPNGBDBM50543137(CHEMBL4634860)
Affinity DataIC50:  4nM. Assay description: Antagonist activity at TLR7 in mouse splenocytes assessed as inhibition of ssRNA40-induced IL6 production
Ligand InfoPC cidPC sid
In DepthDetails ArticlePubMed
TargetToll-like receptor 9(Homo sapiens (Human))
Genomics Institute Of The Novartis Research Foundation
Curated by ChEMBL
LigandPNGBDBM50543137(CHEMBL4634860)
Affinity DataIC50:  1.00E+3nM. Assay description: Antagonist activity at TLR9 in human PBMC assessed as inhibition of ODN2216-induced IFNalpha production
Ligand InfoPC cidPC sid
In DepthDetails ArticlePubMed
TargetToll-like receptor 7(Homo sapiens (Human))
Genomics Institute Of The Novartis Research Foundation
Curated by ChEMBL
LigandPNGBDBM50543137(CHEMBL4634860)
Affinity DataIC50: <1nM. Assay description: Antagonist activity at TLR7 in human PBMC assessed as inhibition of ssRNA40-induced IFNalpha production
Ligand InfoPC cidPC sid
In DepthDetails ArticlePubMed
TargetToll-like receptor 8(Homo sapiens (Human))
Genomics Institute Of The Novartis Research Foundation
Curated by ChEMBL
LigandPNGBDBM50543137(CHEMBL4634860)
Affinity DataIC50: <1nM. Assay description: Antagonist activity at TLR8 in human THP-1 cells assessed as inhibition of resiquimod-induced TNFalpha production
Ligand InfoPC cidPC sid
In DepthDetails ArticlePubMed
TargetToll-like receptor 9(Mus musculus)
Genomics Institute Of The Novartis Research Foundation
Curated by ChEMBL
LigandPNGBDBM50543137(CHEMBL4634860)
Affinity DataIC50:  1.20E+3nM. Assay description: Antagonist activity at TLR9 in mouse splenocytes assessed as inhibition of CpG1585-induced IL6 production
Ligand InfoPC cidPC sid
In DepthDetails ArticlePubMed