BDBM50545192 CHEMBL4647400
SMILES CCN(CC)C(=O)C1=C(C)NC(=S)NC1c1ccc(OC)c(O)c1
InChI Key InChIKey=WZROWSGBENWGCI-UHFFFAOYSA-N
Data  1 IC50
  Tab Delimited (TSV)   2D SDfile   Computed 3D by Vconf -m prep SDfile
Find this compound or compounds like it in BindingDB:
Activity Spreadsheet -- Enzyme Inhibition Constant Data from BindingDB
Found 1 hit for monomerid = 50545192
TargetBeta-glucuronidase(Homo sapiens (Human))
Shiraz University Of Medical Sciences
Curated by ChEMBL
LigandPNGBDBM50545192(CHEMBL4647400)
Affinity DataIC50:  760nM. Assay description: Inhibition of beta-glucuronidase (unknown origin) using p-nitrophenyl-beta-D-glucuronide as substrate pre-incubated for 30 mins followed by substrate...
Ligand InfoPC cidPC sid
In DepthDetails ArticlePubMed