BDBM50547980 CHEMBL4744569
SMILES CN(C)CCNc1ncnc2c(cc(C)cc12)C(=O)Nc1c(Cl)ccc(NS(=O)(=O)c2cc(F)ccc2F)c1F
InChI Key InChIKey=UQPUQRQAVLTTAE-UHFFFAOYSA-N
Data  2 IC50
  Tab Delimited (TSV)   2D SDfile   Computed 3D by Vconf -m prep SDfile
Find this compound or compounds like it in BindingDB:
Activity Spreadsheet -- Enzyme Inhibition Constant Data from BindingDB
Found 2 hits for monomerid = 50547980
TargetSerine/threonine-protein kinase/endoribonuclease IRE1(Homo sapiens (Human))
Paraza Pharma
Curated by ChEMBL
LigandPNGBDBM50547980(CHEMBL4744569)
Affinity DataIC50:  2.90E+4nM. Assay description: Inhibition of IRE1alpha (unknown origin) assessed as XBP-1 slicing luciferase activity incubated for 1 hr followed by stimulation with thapsigargin m...
Ligand InfoPC cidPC sid
In DepthDetails ArticlePubMed
TargetSerine/threonine-protein kinase/endoribonuclease IRE1(Homo sapiens (Human))
Paraza Pharma
Curated by ChEMBL
LigandPNGBDBM50547980(CHEMBL4744569)
Affinity DataIC50:  5.50E+3nM. Assay description: Competitive inhibition of IRE1alpha LKR domain (Q470 to L997 residues) (unknown origin) expressed in Sf9 insect cells using mini-XBP-1 stem-loop RNA ...
Ligand InfoPC cidPC sid
In DepthDetails ArticlePubMed