BDBM50550812 CHEMBL4756283
SMILES CCCn1c2ncn(NC(N)=O)c(=N)c2sc1=S
InChI Key InChIKey=SCWUQQAFVXWQFZ-UHFFFAOYSA-N
Data  2 KI
  Tab Delimited (TSV)   2D SDfile   Computed 3D by Vconf -m prep SDfile
Find this compound or compounds like it in BindingDB:
Activity Spreadsheet -- Enzyme Inhibition Constant Data from BindingDB
Found 2 hits for monomerid = 50550812
TargetAdenosine receptor A2a(Homo sapiens (Human))
University Of Bonn
Curated by ChEMBL
LigandPNGBDBM50550812(CHEMBL4756283)
Affinity DataKi:  0.00380nM. Assay description: Displacement of [3H]MSX2 from human adenosine receptor A2A expressed in HEK293 cell membranes incubated for 30 mins by radioligand competition assay
Ligand InfoPC cidPC sid
In DepthDetails ArticlePubMed
TargetAdenosine receptor A1(Homo sapiens (Human))
University Of Bonn
Curated by ChEMBL
LigandPNGBDBM50550812(CHEMBL4756283)
Affinity DataKi:  2.80nM. Assay description: Displacement of [3H]CCPA from human adenosine receptor A1 expressed in CHO cell membranes incubated for 90 mins by radioligand competition assay
Ligand InfoPC cidPC sid
In DepthDetails ArticlePubMed