BDBM50551956 CHEMBL4756418
SMILES CC(C)(C)OC(=O)N1CC[C@@]2([C@H]1c1cccc(c1)-c1ccc(CO)c(c1)S(C)(=O)=O)C(=O)Nc1ccccc21
InChI Key InChIKey=WCOXMLFEWOILDZ-PDDLMNHVSA-N
Data  1 KI  2 EC50
PDB links: 1 PDB ID matches this monomer.
  Tab Delimited (TSV)   2D SDfile   Computed 3D by Vconf -m prep SDfile
Find this compound or compounds like it in BindingDB:
Activity Spreadsheet -- Enzyme Inhibition Constant Data from BindingDB
Found 3 hits for monomerid = 50551956
TargetOxysterols receptor LXR-beta(Homo sapiens (Human))
Sun Yat-Sen University
Curated by ChEMBL
LigandPNGBDBM50551956(CHEMBL4756418)
Affinity DataKi:  1nM. Assay description: Displacement of hyodeoxycholicacid-based fluorescent tracer from recombinant human LXRbeta LBD (215 to 461 residues) expressed in Escherichia coli BL...
Ligand InfoPC cidPC sidPDB
TargetOxysterols receptor LXR-alpha/Retinoic acid receptor RXR-alpha(Homo sapiens (Human))
Sun Yat-Sen University
Curated by ChEMBL
LigandPNGBDBM50551956(CHEMBL4756418)
Affinity DataEC50:  0.145nM. Assay description: Agonist activity at human RXRalpha/LXRalpha expressed in HEK293 cells measured after 20 hrs by dual luciferase reporter gene assay
Ligand InfoPC cidPC sidPDB
In DepthDetails ArticlePubMed
TargetOxysterols receptor LXR-beta/Retinoic acid receptor RXR-alpha(Homo sapiens (Human))
Sun Yat-Sen University
Curated by ChEMBL
LigandPNGBDBM50551956(CHEMBL4756418)
Affinity DataEC50:  0.0350nM. Assay description: Agonist activity at human RXRalpha/LXRbeta expressed in HEK293 cells measured after 20 hrs by dual luciferase reporter gene assay
Ligand InfoPC cidPC sidPDB