BDBM50552432 CHEMBL4762254
SMILES CC(C)(C)c1ccc2OC(CN3CCN(CC3)c3ccccc3)Cc2c1
InChI Key InChIKey=DJJYMRGYBSNEHG-UHFFFAOYSA-N
Data  2 KI
  Tab Delimited (TSV)   2D SDfile   Computed 3D by Vconf -m prep SDfile
Find this compound or compounds like it in BindingDB:
Activity Spreadsheet -- Enzyme Inhibition Constant Data from BindingDB
Found 2 hits for monomerid = 50552432
TargetHistamine H3 receptor(Homo sapiens (Human))
Universidade Federal De S£O Paulo
Curated by ChEMBL
LigandPNGBDBM50552432(CHEMBL4762254)
Affinity DataKi: <1.00E+4nM. Assay description: Displacement of [3H]-Histamine from human histamine 3 receptor transfected in HEK293T cells incubated for 16 hrs by liquid scintillation counter anal...
Ligand InfoPC cidPC sid
In DepthDetails ArticlePubMed
TargetHistamine H4 receptor(Homo sapiens (Human))
Universidade Federal De S£O Paulo
Curated by ChEMBL
LigandPNGBDBM50552432(CHEMBL4762254)
Affinity DataKi: <1.00E+4nM. Assay description: Displacement of [3H]-Histamine from human histamine 4 receptor transfected in HEK293T cells incubated for 16 hrs by liquid scintillation counter anal...
Ligand InfoPC cidPC sid
In DepthDetails ArticlePubMed