BDBM50553742 CHEMBL4759403
SMILES O=C1COc2cc(Nc3cc4n(CC5CC5)cnc4cn3)ccc2N1
InChI Key InChIKey=NQOIVTNXEBEPQR-UHFFFAOYSA-N
Data  1 KI
  Tab Delimited (TSV)   2D SDfile   Computed 3D by Vconf -m prep SDfile
Find this compound or compounds like it in BindingDB:
Activity Spreadsheet -- Enzyme Inhibition Constant Data from BindingDB
Found 1 hit for monomerid = 50553742
TargetGABA-A receptor; alpha-5/beta-3/gamma-2(Homo sapiens (Human))
Charles River Discovery Research Services
Curated by ChEMBL
LigandPNGBDBM50553742(CHEMBL4759403)
Affinity DataKi:  42nM. Assay description: Displacement of [3H]-Ro15-1788 from human GABAA alpha5beta3gamma2 by scintillation proximity assay
Ligand InfoPC cidPC sid
In DepthDetails ArticlePubMed