BDBM50553750 CHEMBL4761610
SMILES CN1C(=O)COc2cc(Nc3cc4n(CC5CC5)cnc4cn3)cnc12
InChI Key InChIKey=NIWQZRKLKJGSBU-UHFFFAOYSA-N
Data  1 KI
  Tab Delimited (TSV)   2D SDfile   Computed 3D by Vconf -m prep SDfile
Find this compound or compounds like it in BindingDB:
Activity Spreadsheet -- Enzyme Inhibition Constant Data from BindingDB
Found 1 hit for monomerid = 50553750
TargetGABA-A receptor; alpha-5/beta-3/gamma-2(Homo sapiens (Human))
Charles River Discovery Research Services
Curated by ChEMBL
LigandPNGBDBM50553750(CHEMBL4761610)
Affinity DataKi:  38nM. Assay description: Displacement of [3H]-Ro15-1788 from human GABAA alpha5beta3gamma2 by scintillation proximity assay
Ligand InfoPC cidPC sid
In DepthDetails ArticlePubMed