BDBM50554465 CHEMBL4776064
SMILES COc1ccc(cc1)-c1n[nH]c(=O)o1
InChI Key InChIKey=YRYGGQXFJDSZLH-UHFFFAOYSA-N
Data  1 IC50
  Tab Delimited (TSV)   2D SDfile   Computed 3D by Vconf -m prep SDfile
Find this compound or compounds like it in BindingDB:
Activity Spreadsheet -- Enzyme Inhibition Constant Data from BindingDB
Found 1 hit for monomerid = 50554465
TargetPalmitoleoyl-protein carboxylesterase NOTUM(Homo sapiens (Human))
University College London
Curated by ChEMBL
LigandPNGBDBM50554465(CHEMBL4776064)
Affinity DataIC50:  1.40nM. Assay description: Inhibition of human Notum (S81-T451 residues) C330S mutant expressed in HEK293S cells using OPTS substrate incubated for 40 mins by fluorescence base...
In DepthDetails ArticlePubMed