BDBM50554470 CHEMBL4752559
SMILES CC(C)c1ccc(cc1)-c1n[nH]c(=O)o1
InChI Key InChIKey=BMHMAEDSRHFCIW-UHFFFAOYSA-N
Data  1 IC50
  Tab Delimited (TSV)   2D SDfile   Computed 3D by Vconf -m prep SDfile
Find this compound or compounds like it in BindingDB:
Activity Spreadsheet -- Enzyme Inhibition Constant Data from BindingDB
Found 1 hit for monomerid = 50554470
TargetPalmitoleoyl-protein carboxylesterase NOTUM(Homo sapiens (Human))
University College London
Curated by ChEMBL
LigandPNGBDBM50554470(CHEMBL4752559)
Affinity DataIC50:  0.0750nM. Assay description: Inhibition of human Notum (S81-T451 residues) C330S mutant expressed in HEK293S cells using OPTS substrate incubated for 40 mins by fluorescence base...
Ligand InfoPC cidPC sid
In DepthDetails ArticlePubMed