BDBM50556422 CHEMBL4779543
SMILES COc1ccc(cc1)C(=O)c1cnc(NC(=O)C2(CC2)c2ccc3OCOc3c2)s1
InChI Key InChIKey=YWYZUDOXUWNVGE-UHFFFAOYSA-N
Data  1 EC50
  Tab Delimited (TSV)   2D SDfile   Computed 3D by Vconf -m prep SDfile
Find this compound or compounds like it in BindingDB:
Activity Spreadsheet -- Enzyme Inhibition Constant Data from BindingDB
Found 1 hit for monomerid = 50556422
TargetCystic fibrosis transmembrane conductance regulator(Homo sapiens (Human))
University Of Genoa
Curated by ChEMBL
LigandPNGBDBM50556422(CHEMBL4779543)
Affinity DataEC50:  9.30E+3nM. Assay description: Correction activity at CFTR F508del mutant (unknown origin) expressed in CFBE41o- cells coexpressing HS-YFP preincubated for 24 hrs followed by forsk...
Ligand InfoPC cidPC sid
In DepthDetails ArticlePubMed