BDBM50556435 CHEMBL4786072
SMILES O=C(Nc1nc(c(s1)C(=O)c1ccc(cc1)N1CCCC1)-c1ccccc1)C1(CC1)c1ccc2OCOc2c1
InChI Key InChIKey=MEGAEERTOWNKHC-UHFFFAOYSA-N
Data  1 EC50
  Tab Delimited (TSV)   2D SDfile   Computed 3D by Vconf -m prep SDfile
Find this compound or compounds like it in BindingDB:
Activity Spreadsheet -- Enzyme Inhibition Constant Data from BindingDB
Found 1 hit for monomerid = 50556435
TargetCystic fibrosis transmembrane conductance regulator(Homo sapiens (Human))
University Of Genoa
Curated by ChEMBL
LigandPNGBDBM50556435(CHEMBL4786072)
Affinity DataEC50:  370nM. Assay description: Correction activity at CFTR F508del mutant (unknown origin) expressed in CFBE41o- cells coexpressing HS-YFP preincubated for 24 hrs followed by forsk...
Ligand InfoPC cidPC sid
In DepthDetails ArticlePubMed