BDBM50556441 CHEMBL4776895
SMILES COc1ccc(OC)c(c1)C(=O)c1sc(NC(=O)C2(CC2)c2ccc3OCOc3c2)nc1-c1ccccc1
InChI Key InChIKey=ZBHDDLLZJFKGAL-UHFFFAOYSA-N
Data  1 EC50
  Tab Delimited (TSV)   2D SDfile   Computed 3D by Vconf -m prep SDfile
Find this compound or compounds like it in BindingDB:
Activity Spreadsheet -- Enzyme Inhibition Constant Data from BindingDB
Found 1 hit for monomerid = 50556441
TargetCystic fibrosis transmembrane conductance regulator(Homo sapiens (Human))
University Of Genoa
Curated by ChEMBL
LigandPNGBDBM50556441(CHEMBL4776895)
Affinity DataEC50:  110nM. Assay description: Correction activity at CFTR F508del mutant (unknown origin) expressed in CFBE41o- cells coexpressing HS-YFP preincubated for 24 hrs followed by forsk...
Ligand InfoPC cidPC sid
In DepthDetails ArticlePubMed