BDBM50558352 CHEMBL4748538
SMILES O=C(NC1CC2CCC(C1)N2Cc1ccccc1)c1ccc2ccccc2n1
InChI Key InChIKey=JAINGJLAHUUKKM-UHFFFAOYSA-N
Data  3 KI
  Tab Delimited (TSV)   2D SDfile   Computed 3D by Vconf -m prep SDfile
Find this compound or compounds like it in BindingDB:
Activity Spreadsheet -- Enzyme Inhibition Constant Data from BindingDB
Found 3 hits for monomerid = 50558352
Target5-hydroxytryptamine receptor 1A(Rattus norvegicus (rat))
Medical University Of Warsaw
Curated by ChEMBL
LigandPNGBDBM50558352(CHEMBL4748538)
Affinity DataKi:  63nM. Assay description: Displacement of [3H]-8-OH-DPAT from rat cerebral cortex 5HT1A receptor measured after 15 mins by liquid scintillation counter method
Ligand InfoPC cidPC sid
In DepthDetails ArticlePubMed
Target5-hydroxytryptamine receptor 2A(Rattus norvegicus (rat))
Medical University Of Warsaw
Curated by ChEMBL
LigandPNGBDBM50558352(CHEMBL4748538)
Affinity DataKi:  502nM. Assay description: Displacement of [3H]-ketanserin from rat cerebral cortex 5HT2A receptor measured after 20 mins by liquid scintillation counter method
Ligand InfoPC cidPC sid
In DepthDetails ArticlePubMed
TargetD(2) dopamine receptor(Rattus norvegicus (rat))
Medical University Of Warsaw
Curated by ChEMBL
LigandPNGBDBM50558352(CHEMBL4748538)
Affinity DataKi:  589nM. Assay description: Displacement of [3H] Spiperone from rat striatum dopamine D2 receptor measured after 30 mins by liquid scintillation counter method
Ligand InfoPC cidPC sid
In DepthDetails ArticlePubMed