BDBM50558625 CHEMBL4759898
SMILES FC(F)(F)c1cc(nc2cc(nn12)-c1cccs1)-c1cccnc1
InChI Key InChIKey=RWLHWCLWPGYWAX-UHFFFAOYSA-N
Data  1 IC50
  Tab Delimited (TSV)   2D SDfile   Computed 3D by Vconf -m prep SDfile
Find this compound or compounds like it in BindingDB:
Activity Spreadsheet -- Enzyme Inhibition Constant Data from BindingDB
Found 1 hit for monomerid = 50558625
TargetFar upstream element-binding protein 1(Homo sapiens)
Institute For Tumor Biology And Experimental Therapy
Curated by ChEMBL
LigandPNGBDBM50558625(CHEMBL4759898)
Affinity DataIC50: >1.00E+5nM. Assay description: Inhibition of 6xHis-tagged human FUBP1 expressed in HEK293T cells assessed as reduction in FUBP1 interaction with biotinylated NLC chip immobilized F...
Ligand InfoPC cidPC sid
In DepthDetails ArticlePubMed