BDBM50558630 CHEMBL4759937
SMILES COc1ccc(cc1OC)-c1cc(n2nc(cc2n1)-c1ccc(Cl)s1)C(F)(F)F
InChI Key InChIKey=JOSWAHOEAZDEAL-UHFFFAOYSA-N
Data  1 IC50
  Tab Delimited (TSV)   2D SDfile   Computed 3D by Vconf -m prep SDfile
Find this compound or compounds like it in BindingDB:
Activity Spreadsheet -- Enzyme Inhibition Constant Data from BindingDB
Found 1 hit for monomerid = 50558630
TargetFar upstream element-binding protein 1(Homo sapiens)
Institute For Tumor Biology And Experimental Therapy
Curated by ChEMBL
LigandPNGBDBM50558630(CHEMBL4759937)
Affinity DataIC50:  1.14E+4nM. Assay description: Inhibition of 6xHis-tagged human FUBP1 expressed in HEK293T cells assessed as reduction in FUBP1 interaction with biotinylated NLC chip immobilized F...
Ligand InfoPC cidPC sid
In DepthDetails ArticlePubMed