BDBM50558642 CHEMBL4741475
SMILES CC(=O)NCCOc1ccc(Cc2ccc(NC(C)=O)cc2)c(C)c1
InChI Key InChIKey=SPYMQTUPGYZASA-UHFFFAOYSA-N
Data  1 EC50
  Tab Delimited (TSV)   2D SDfile   Computed 3D by Vconf -m prep SDfile
Find this compound or compounds like it in BindingDB:
Activity Spreadsheet -- Enzyme Inhibition Constant Data from BindingDB
Found 1 hit for monomerid = 50558642
TargetTrace amine-associated receptor 1(Mus musculus (Mouse))
University Of Pisa
Curated by ChEMBL
LigandPNGBDBM50558642(CHEMBL4741475)
Affinity DataEC50: >1.00E+4nM. Assay description: Agonist activity at mouse TAAR1 expressed in HEK293T cells assessed as induction of cAMP production by BRET assay
Ligand InfoPC cidPC sid
In DepthDetails ArticlePubMed