BDBM50558649 CHEMBL4778053
SMILES Cc1cc(OCCN)cc(C)c1Cc1ccc(N)cc1
InChI Key InChIKey=OGAAIXJYFARWPV-UHFFFAOYSA-N
Data  1 EC50
  Tab Delimited (TSV)   2D SDfile   Computed 3D by Vconf -m prep SDfile
Find this compound or compounds like it in BindingDB:
Activity Spreadsheet -- Enzyme Inhibition Constant Data from BindingDB
Found 1 hit for monomerid = 50558649
TargetTrace amine-associated receptor 1(Mus musculus (Mouse))
University Of Pisa
Curated by ChEMBL
LigandPNGBDBM50558649(CHEMBL4778053)
Affinity DataEC50:  134nM. Assay description: Agonist activity at mouse TAAR1 expressed in HEK293T cells assessed as induction of cAMP production by BRET assay
Ligand InfoPC cidPC sid
In DepthDetails ArticlePubMed